Reaction Details
TargetNeuronal acetylcholine receptor subunit alpha-9
LigandBDBM50408544
Substrate/Competitorn/a
Meas. Tech.ChEMBL_142899 (CHEMBL748708)
Kd 0.027±n/a nM
Citation Horti, AGScheffel, UKimes, ASMusachio, JLRavert, HTMathews, WBZhan, YFinley, PALondon, EDDannals, RF Synthesis and evaluation of N-[11C]methylated analogues of epibatidine as tracers for positron emission tomographic studies of nicotinic acetylcholine receptors. J Med Chem41:4199-206 (1998) 
 
Neuronal acetylcholine receptor subunit alpha-9
Name:Neuronal acetylcholine receptor subunit alpha-9
Type:Enzyme Catalytic Domain
Mol. Mass.:54522.69
Organism:RAT
Description:Cholinergic, Nicotinic Muscle 0 RAT::P43144
Residue:479
BDBM50408544
NameBDBM50408544
Synonyms:CHEMBL134341
TypeSmall organic molecule
Emp. Form.C13H16ClN
Mol. Mass.221.726
SMILESCN1C2CCC1C(C2)c1ccc(Cl)cc1