Reaction Details
TargetNeuronal acetylcholine receptor subunit alpha-4/beta-2
LigandBDBM50088454
Substrate/Competitorn/a
Meas. Tech.ChEMBL_143711 (CHEMBL756010)
IC50 1±n/a nM
Citation Nielsen, SFNielsen, EOOlsen, GMLiljefors, TPeters, D Novel potent ligands for the central nicotinic acetylcholine receptor: synthesis, receptor binding, and 3D-QSAR analysis. J Med Chem43:2217-26 (2000) Neuronal acetylcholine receptor subunit alpha-4/beta-2
Name:Neuronal acetylcholine receptor subunit alpha-4/beta-2
Type:n/a
Mol. Mass.:n/a
Description:n/a
Components:This complex has 0 components.
Component 1
Name:Neuronal acetylcholine receptor subunit alpha-4
Synonyms:ACHA4_RAT Cholinergic, Nicotinic Alpha4Beta2 Chrna4 Neuronal acetylcholine receptor (alpha4beta2 nAChR) Neuronal acetylcholine receptor subunit alpha 4 beta 2 | Neuronal acetylcholine receptor subunit alpha-4
Type:Enzyme
Mol. Mass.:70196.44
Organism:Rattus norvegicus (Rat)
Description:P09483
Residue:630
Component 2
Name:Neuronal acetylcholine receptor subunit beta-2
Synonyms:ACHB2_RAT Chrnb2 Neuronal acetylcholine receptor non-alpha-1 chain
Type:Enzyme
Mol. Mass.:56910.32
Organism:Rattus norvegicus (Rat)
Description:P12390
Residue:500
BDBM50088454
NameBDBM50088454
Synonyms:1-(6-Bromo-pyridin-3-yl)-[1,4]diazepane CHEMBL306387 | NS3920, 4
TypeSmall organic molecule
Emp. Form.C10H14BrN3
Mol. Mass.256.142
SMILESBrc1ccc(cn1)N1CCCNCC1