Reaction Details
TargetEpidermal growth factor receptor
LigandBDBM4301
Substrate/Competitorn/a
Meas. Tech.ChEMBL_66876 (CHEMBL676067)
IC50 4466.84±n/a nM
Citation Kamath, SBuolamwini, JK Receptor-guided alignment-based comparative 3D-QSAR studies of benzylidene malonitrile tyrphostins as EGFR and HER-2 kinase inhibitors. J Med Chem46:4657-68 (2003) 
 
Epidermal growth factor receptor
Name:Epidermal growth factor receptor
Type:Receptor Kinase Domain
Mol. Mass.:134279.59
Organism:Homo sapiens (Human)
Description:P00533
Residue:1210
BDBM4301
NameBDBM4301
Synonyms:(2E)-2-cyano-3-(3,4-dihydroxyphenyl)prop-2-enamide Tyrphostin deriv. 40 | benzylidenemalononitrile (BMN) deriv. 46
TypeSmall organic molecule
Emp. Form.C10H8N2O3
Mol. Mass.204.1821
SMILESNC(=O)C(=C\c1ccc(O)c(O)c1)\C#N