Reaction Details
TargetHistidine-rich protein PFHRP-II
LigandBDBM50123613
Substrate/Competitorn/a
Meas. Tech.ChEMBL_215891 (CHEMBL820823)
IC50 47.8±n/a nM
Citation Ryckebusch, ADeprez-Poulain, RMaes, LDebreu-Fontaine, MAMouray, EGrellier, PSergheraert, C Synthesis and in vitro and in vivo antimalarial activity of N1-(7-chloro-4-quinolyl)-1,4-bis(3-aminopropyl)piperazine derivatives. J Med Chem46:542-57 (2003) 
 
Histidine-rich protein PFHRP-II
Name:Histidine-rich protein PFHRP-II
Type:PROTEIN
Mol. Mass.:35156.49
Organism:Plasmodium falciparum
Description:ChEMBL_500704
Residue:332
BDBM50123613
NameBDBM50123613
Synonyms:CHEMBL152886 | [3-(4-{3-[Bis-(4-methoxy-benzyl)-amino]-propyl}-piperazin-1-yl)-propyl]-(7-chloro-quinolin-4-yl)-amine
TypeSmall organic molecule
Emp. Form.C35H44ClN5O2
Mol. Mass.602.209
SMILESCOc1ccc(CN(CCCN2CCN(CCCNc3ccnc4cc(Cl)ccc34)CC2)Cc2ccc(OC)cc2)cc1