Reaction Details
TargetGag-Pol polyprotein [489-587]
LigandBDBM50410028
Substrate/Competitorn/a
Meas. Tech.ChEMBL_308167 (CHEMBL834181)
Ki 0.302±n/a nM
Citation Garg, RPatel, D Hydrophobicity in the design of P2/P2' tetrahydropyrimidinone HIV protease inhibitors. Bioorg Med Chem Lett15:3767-70 (2005) 
 
Gag-Pol polyprotein [489-587]
Name:Gag-Pol polyprotein [489-587]
Type:Enzyme Subunit
Mol. Mass.:10781.16
Organism:Human immunodeficiency virus type 1
Description:P04585[489-587]
Residue:99
BDBM50410028
NameBDBM50410028
Synonyms:CHEMBL359753
TypeSmall organic molecule
Emp. Form.C31H30N2O4
Mol. Mass.494.5809
SMILESO[C@@H]1[C@@H](CCc2ccccc2)N(C(=O)N([C@@H]1Cc1ccccc1)c1cccc(O)c1)c1cccc(O)c1