Reaction Details
TargetGag-Pol polyprotein [489-587]
LigandBDBM50410041
Substrate/Competitorn/a
Meas. Tech.ChEMBL_308167 (CHEMBL834181)
Ki 0.0182±n/a nM
Citation Garg, RPatel, D Hydrophobicity in the design of P2/P2' tetrahydropyrimidinone HIV protease inhibitors. Bioorg Med Chem Lett15:3767-70 (2005) 
 
Gag-Pol polyprotein [489-587]
Name:Gag-Pol polyprotein [489-587]
Type:Enzyme Subunit
Mol. Mass.:10781.16
Organism:Human immunodeficiency virus type 1
Description:P04585[489-587]
Residue:99
BDBM50410041
NameBDBM50410041
Synonyms:CHEMBL178951
TypeSmall organic molecule
Emp. Form.C34H35N5O4
Mol. Mass.577.6728
SMILESNC(C=O)c1cccc(c1)N1[C@H](Cc2ccccc2)[C@H](O)[C@@H](CCc2ccccc2)N(C1=O)c1cccc(c1)C(=N)NO