Reaction Details
TargetPotassium voltage-gated channel subfamily KQT member 2
LigandBDBM50143558
Substrate/Competitorn/a
Meas. Tech.ChEMBL_310664 (CHEMBL838011)
EC50 1300±n/a nM
Citation L'Heureux, AMartel, AHe, HChen, JSun, LQStarrett, JENatale, JDworetzky, SIKnox, RJHarden, DGWeaver, DThompson, MWWu, YJ (S,E)-N-[1-(3-heteroarylphenyl)ethyl]-3-(2-fluorophenyl)acrylamides: synthesis and KCNQ2 potassium channel opener activity. Bioorg Med Chem Lett15:363-6 (2004) 
 
Potassium voltage-gated channel subfamily KQT member 2
Name:Potassium voltage-gated channel subfamily KQT member 2
Type:PROTEIN
Mol. Mass.:84494.02
Organism:Mus musculus
Description:ChEMBL_990142
Residue:759
BDBM50143558
NameBDBM50143558
Synonyms:CHEMBL41355 N-(2-amino-4-(4-fluorobenzylamino)-phenyl)carbamic acid ethylester [2-Amino-4-(4-fluoro-benzylamino)-phenyl]-carbamic acid ethyl ester
TypeSmall organic molecule
Emp. Form.C16H18FN3O2
Mol. Mass.303.3314
SMILESCCOC(=O)Nc1ccc(NCc2ccc(F)cc2)cc1N