Reaction Details
Target5-hydroxytryptamine receptor 2C
LigandBDBM50410473
Substrate/Competitorn/a
Meas. Tech.ChEMBL_321084 (CHEMBL872164)
Ki 2±n/a nM
Citation Goodacre, CJBromidge, SMClapham, DKing, FDLovell, PJAllen, MCampbell, LPHolland, VRiley, GJStarr, KRTrail, BKWood, MD A series of bisaryl imidazolidin-2-ones has shown to be selective and orally active 5-HT2C receptor antagonists. Bioorg Med Chem Lett15:4989-93 (2005) 
 
5-hydroxytryptamine receptor 2C
Name:5-hydroxytryptamine receptor 2C
Type:G Protein-Coupled Receptor (GPCR)
Mol. Mass.:51836.79
Organism:Homo sapiens (Human)
Description:P28335
Residue:458
BDBM50410473
NameBDBM50410473
Synonyms:CHEMBL198171
TypeSmall organic molecule
Emp. Form.C25H30F3N3O3
Mol. Mass.477.5192
SMILESCOc1ccc(cc1OCCN1CCCCC1)N1CCN(C1=O)c1ccc(C)c(c1)C(F)(F)F