Reaction Details
TargetHistidine-rich protein PFHRP-II
LigandBDBM50176380
Substrate/Competitorn/a
Meas. Tech.ChEMBL_328025 (CHEMBL863915)
IC50 50000±n/a nM
Citation Melnyk, PLeroux, VSergheraert, CGrellier, P Design, synthesis and in vitro antimalarial activity of an acylhydrazone library. Bioorg Med Chem Lett16:31-5 (2005) 
 
Histidine-rich protein PFHRP-II
Name:Histidine-rich protein PFHRP-II
Type:PROTEIN
Mol. Mass.:35156.49
Organism:Plasmodium falciparum
Description:ChEMBL_500704
Residue:332
BDBM50176380
NameBDBM50176380
Synonyms:CHEMBL197970 | N'-(4-(diethylamino)-2-hydroxybenzylidene)benzohydrazide
TypeSmall organic molecule
Emp. Form.C18H21N3O2
Mol. Mass.311.3782
SMILESCCN(CC)c1ccc(C=NNC(=O)c2ccccc2)c(O)c1