Reaction Details
TargetTryptase beta-2
LigandBDBM50410998
Substrate/Competitorn/a
Meas. Tech.ChEMBL_370996 (CHEMBL868494)
Ki 9.2±n/a nM
Citation Palmer, JTRydzewski, RMMendonca, RVSperandio, DSpencer, JRHirschbein, BLLohman, JBeltman, JNguyen, MLiu, L Design and synthesis of selective keto-1,2,4-oxadiazole-based tryptase inhibitors. Bioorg Med Chem Lett16:3434-9 (2006) 
 
Tryptase beta-2
Name:Tryptase beta-2
Type:PROTEIN
Mol. Mass.:30518.79
Organism:Homo sapiens (Human)
Description:ChEMBL_210702
Residue:275
BDBM50410998
NameBDBM50410998
Synonyms:CHEMBL535617
TypeSmall organic molecule
Emp. Form.C29H35Cl2N5O4
Mol. Mass.588.525
SMILESNCCCC[C@H](NC(=O)N1CCCCC1)C(=O)c1noc(Cc2ccc(OCCc3ccc(Cl)c(Cl)c3)cc2)n1