Reaction Details
TargetGranzyme K
LigandBDBM50410995
Substrate/Competitorn/a
Meas. Tech.ChEMBL_371006 (CHEMBL868504)
Ki>150000±n/a nM
Citation Palmer, JTRydzewski, RMMendonca, RVSperandio, DSpencer, JRHirschbein, BLLohman, JBeltman, JNguyen, MLiu, L Design and synthesis of selective keto-1,2,4-oxadiazole-based tryptase inhibitors. Bioorg Med Chem Lett16:3434-9 (2006) 
 
Granzyme K
Name:Granzyme K
Type:PROTEIN
Mol. Mass.:28902.79
Organism:Homo sapiens (Human)
Description:ChEMBL_162618
Residue:264
BDBM50410995
NameBDBM50410995
Synonyms:CHEMBL536972
TypeSmall organic molecule
Emp. Form.C30H28Cl2F2N4O4
Mol. Mass.617.471
SMILESNCCCC[C@H](NC(=O)c1ccc(F)c(F)c1)C(=O)c1noc(Cc2ccc(OCCc3ccc(Cl)c(Cl)c3)cc2)n1