Reaction Details
TargetReverse transcriptase/RNaseH
LigandBDBM50411076
Substrate/Competitorn/a
Meas. Tech.ChEMBL_373028 (CHEMBL871572)
EC50 3360±n/a nM
Citation Mugnaini, CManetti, FEsté, JAClotet-Codina, IMaga, GCancio, RBotta, MCorelli, F Synthesis and biological investigation of S-aryl-S-DABO derivatives as HIV-1 inhibitors. Bioorg Med Chem Lett16:3541-4 (2006) 
 
Reverse transcriptase/RNaseH
Name:Reverse transcriptase/RNaseH
Type:PROTEIN
Mol. Mass.:65229.15
Organism:Human immunodeficiency virus 1
Description:ChEMBL_1473730
Residue:566
BDBM50411076
NameBDBM50411076
Synonyms:CHEMBL210820
TypeSmall organic molecule
Emp. Form.C18H12Cl2F2N2OS
Mol. Mass.413.268
SMILESCc1c(Cc2c(Cl)cccc2Cl)nc(Sc2ccc(F)cc2F)[nH]c1=O