Reaction Details
TargetReverse transcriptase/RNaseH
LigandBDBM50411074
Substrate/Competitorn/a
Meas. Tech.ChEMBL_373032 (CHEMBL871579)
EC50>61400±n/a nM
Citation Mugnaini, CManetti, FEsté, JAClotet-Codina, IMaga, GCancio, RBotta, MCorelli, F Synthesis and biological investigation of S-aryl-S-DABO derivatives as HIV-1 inhibitors. Bioorg Med Chem Lett16:3541-4 (2006) 
 
Reverse transcriptase/RNaseH
Name:Reverse transcriptase/RNaseH
Type:PROTEIN
Mol. Mass.:65229.15
Organism:Human immunodeficiency virus 1
Description:ChEMBL_1473730
Residue:566
BDBM50411074
NameBDBM50411074
Synonyms:CHEMBL211344
TypeSmall organic molecule
Emp. Form.C19H16Cl2N2O2S
Mol. Mass.407.314
SMILESCOc1ccc(Sc2nc(Cc3c(Cl)cccc3Cl)c(C)c(=O)[nH]2)cc1