Reaction Details
TargetReverse transcriptase/RNaseH
LigandBDBM2483
Substrate/Competitorn/a
Meas. Tech.ChEMBL_373029 (CHEMBL871573)
EC50 200±n/a nM
Citation Mugnaini, CManetti, FEsté, JAClotet-Codina, IMaga, GCancio, RBotta, MCorelli, F Synthesis and biological investigation of S-aryl-S-DABO derivatives as HIV-1 inhibitors. Bioorg Med Chem Lett16:3541-4 (2006) 
 
Reverse transcriptase/RNaseH
Name:Reverse transcriptase/RNaseH
Type:PROTEIN
Mol. Mass.:65229.15
Organism:Human immunodeficiency virus 1
Description:ChEMBL_1473730
Residue:566
BDBM2483
NameBDBM2483
Synonyms:(4S)-6-chloro-4-(2-cyclopropylethynyl)-4-(trifluoromethyl)-2,4-dihydro-1H-3,1-benzoxazin-2-one DMP-266 Efavirenz L-743,726 | Sustiva
TypeSmall organic molecule
Emp. Form.C14H9ClF3NO2
Mol. Mass.315.675
SMILESFC(F)(F)[C@]1(OC(=O)Nc2ccc(Cl)cc12)C#CC1CC1