Reaction Details
TargetReverse transcriptase/RNaseH
LigandBDBM50411079
Substrate/Competitorn/a
Meas. Tech.ChEMBL_373032 (CHEMBL871579)
EC50>27600±n/a nM
Citation Mugnaini, CManetti, FEsté, JAClotet-Codina, IMaga, GCancio, RBotta, MCorelli, F Synthesis and biological investigation of S-aryl-S-DABO derivatives as HIV-1 inhibitors. Bioorg Med Chem Lett16:3541-4 (2006) 
 
Reverse transcriptase/RNaseH
Name:Reverse transcriptase/RNaseH
Type:PROTEIN
Mol. Mass.:65229.15
Organism:Human immunodeficiency virus 1
Description:ChEMBL_1473730
Residue:566
BDBM50411079
NameBDBM50411079
Synonyms:CHEMBL379190
TypeSmall organic molecule
Emp. Form.C19H13Cl2N3OS
Mol. Mass.402.297
SMILESCc1c(Cc2c(Cl)cccc2Cl)nc(Sc2ccc(cc2)C#N)[nH]c1=O