Reaction Details
TargetE-selectin
LigandBDBM50411200
Substrate/Competitorn/a
Meas. Tech.ChEMBL_416605 (CHEMBL630112)
IC50 35000±n/a nM
Citation Ulbrich, HKLuxenburger, APrech, PEriksson, EESoehnlein, ORotzius, PLindbom, LDannhardt, G A novel class of potent nonglycosidic and nonpeptidic pan-selectin inhibitors. J Med Chem49:5988-99 (2006) 
 
E-selectin
Name:E-selectin
Type:PROTEIN
Mol. Mass.:66642.96
Organism:Homo sapiens (Human)
Description:ChEMBL_1438995
Residue:610
BDBM50411200
NameBDBM50411200
Synonyms:CHEMBL385486
TypeSmall organic molecule
Emp. Form.C46H65NO8
Mol. Mass.760.0102
SMILESCCCCCCCCCCOc1cc(OCCCCCCCCCC)cc(OCCCCCC(=O)N(c2ccc(cc2)C(O)=O)c2cccc(c2)C(O)=O)c1