Reaction Details
TargetE-selectin
LigandBDBM50411201
Substrate/Competitorn/a
Meas. Tech.ChEMBL_416605 (CHEMBL630112)
IC50 28000±n/a nM
Citation Ulbrich, HKLuxenburger, APrech, PEriksson, EESoehnlein, ORotzius, PLindbom, LDannhardt, G A novel class of potent nonglycosidic and nonpeptidic pan-selectin inhibitors. J Med Chem49:5988-99 (2006) 
 
E-selectin
Name:E-selectin
Type:PROTEIN
Mol. Mass.:66642.96
Organism:Homo sapiens (Human)
Description:ChEMBL_1438995
Residue:610
BDBM50411201
NameBDBM50411201
Synonyms:CHEMBL217490
TypeSmall organic molecule
Emp. Form.C46H67NO7
Mol. Mass.746.0267
SMILESCCCCCCCCCCOc1cc(OCCCCCCCCCC)cc(OCCCCCCN(c2ccc(cc2)C(O)=O)c2ccc(cc2)C(O)=O)c1