Reaction Details
TargetAmine oxidase [flavin-containing] B
LigandBDBM50409097
Substrate/Competitorn/a
Meas. Tech.ChEMBL_417161 (CHEMBL909462)
IC50 0.912±n/a nM
Citation Novaroli, LDaina, AFavre, EBravo, JCarotti, ALeonetti, FCatto, MCarrupt, PAReist, M Impact of species-dependent differences on screening, design, and development of MAO B inhibitors. J Med Chem49:6264-72 (2006) 
 
Amine oxidase [flavin-containing] B
Name:Amine oxidase [flavin-containing] B
Type:Protein
Mol. Mass.:58768.76
Organism:Homo sapiens (Human)
Description:P27338
Residue:520
BDBM50409097
NameBDBM50409097
Synonyms:CHEMBL108697
TypeSmall organic molecule
Emp. Form.C18H15FO3
Mol. Mass.298.3083
SMILESCc1c(C)c(=O)oc2cc(OCc3cccc(F)c3)ccc12