Reaction Details
TargetAmine oxidase [flavin-containing] B
LigandBDBM50409081
Substrate/Competitorn/a
Meas. Tech.ChEMBL_417161 (CHEMBL909462)
IC50 1.07±n/a nM
Citation Novaroli, LDaina, AFavre, EBravo, JCarotti, ALeonetti, FCatto, MCarrupt, PAReist, M Impact of species-dependent differences on screening, design, and development of MAO B inhibitors. J Med Chem49:6264-72 (2006) 
 
Amine oxidase [flavin-containing] B
Name:Amine oxidase [flavin-containing] B
Type:Protein
Mol. Mass.:58768.76
Organism:Homo sapiens (Human)
Description:P27338
Residue:520
BDBM50409081
NameBDBM50409081
Synonyms:CHEMBL111309
TypeSmall organic molecule
Emp. Form.C18H16O3
Mol. Mass.280.3178
SMILESCc1c(C)c(=O)oc2cc(OCc3ccccc3)ccc12