Reaction Details
TargetAmine oxidase [flavin-containing] B
LigandBDBM50409111
Substrate/Competitorn/a
Meas. Tech.ChEMBL_417161 (CHEMBL909462)
IC50 1.41±n/a nM
Citation Novaroli, LDaina, AFavre, EBravo, JCarotti, ALeonetti, FCatto, MCarrupt, PAReist, M Impact of species-dependent differences on screening, design, and development of MAO B inhibitors. J Med Chem49:6264-72 (2006) 
 
Amine oxidase [flavin-containing] B
Name:Amine oxidase [flavin-containing] B
Type:Protein
Mol. Mass.:58768.76
Organism:Homo sapiens (Human)
Description:P27338
Residue:520
BDBM50409111
NameBDBM50409111
Synonyms:CHEMBL356714
TypeSmall organic molecule
Emp. Form.C19H15NO3
Mol. Mass.305.3273
SMILESCc1c(C)c(=O)oc2cc(OCc3cccc(c3)C#N)ccc12