Reaction Details
TargetATP-dependent translocase ABCB1
LigandBDBM50375813
Substrate/Competitorn/a
Meas. Tech.ChEMBL_458148 (CHEMBL925481)
IC50 355±n/a nM
Citation Müller, HKlinkhammer, WGlobisch, CKassack, MUPajeva, IKWiese, M New functional assay of P-glycoprotein activity using Hoechst 33342. Bioorg Med Chem15:7470-9 (2007) 
 
ATP-dependent translocase ABCB1
Name:ATP-dependent translocase ABCB1
Type:Protein
Mol. Mass.:141503.50
Organism:Homo sapiens (Human)
Description:P08183
Residue:1280
BDBM50375813
NameBDBM50375813
Synonyms:CHEMBL428402 | XR-9577
TypeSmall organic molecule
Emp. Form.C34H30N4O2
Mol. Mass.526.6276
SMILESO=C(Nc1ccccc1C(=O)Nc1ccc(CCN2CCc3ccccc3C2)cc1)c1cnc2ccccc2c1