Reaction Details
TargetNeprilysin
LigandBDBM50411725
Substrate/Competitorn/a
Meas. Tech.ChEMBL_465246 (CHEMBL933040)
Ki 2.6±n/a nM
Citation Deaton, DNGao, ENGraham, KPGross, JWMiller, ABStrelow, JM Thiol-based angiotensin-converting enzyme 2 inhibitors: P1 modifications for the exploration of the S1 subsite. Bioorg Med Chem Lett18:732-7 (2008) 
 
Neprilysin
Name:Neprilysin
Type:Enzyme
Mol. Mass.:85505.38
Organism:Homo sapiens (Human)
Description:P08473
Residue:750
BDBM50411725
NameBDBM50411725
Synonyms:CHEMBL271223
TypeSmall organic molecule
Emp. Form.C22H27NO3S
Mol. Mass.385.52
SMILESCC(C)(C)C[C@H](S)C(=O)N[C@@H](Cc1ccc(cc1)-c1ccccc1)C(O)=O