Reaction Details
TargetNeprilysin
LigandBDBM50411732
Substrate/Competitorn/a
Meas. Tech.ChEMBL_465246 (CHEMBL933040)
Ki 730±n/a nM
Citation Deaton, DNGao, ENGraham, KPGross, JWMiller, ABStrelow, JM Thiol-based angiotensin-converting enzyme 2 inhibitors: P1 modifications for the exploration of the S1 subsite. Bioorg Med Chem Lett18:732-7 (2008) 
 
Neprilysin
Name:Neprilysin
Type:Enzyme
Mol. Mass.:85505.38
Organism:Homo sapiens (Human)
Description:P08473
Residue:750
BDBM50411732
NameBDBM50411732
Synonyms:CHEMBL404044
TypeSmall organic molecule
Emp. Form.C19H21NO3S
Mol. Mass.343.44
SMILESCC(C)(S)C(=O)N[C@@H](Cc1ccc(cc1)-c1ccccc1)C(O)=O