Reaction Details
TargetAngiotensin-converting enzyme 2
LigandBDBM50411731
Substrate/Competitorn/a
Meas. Tech.ChEMBL_465244 (CHEMBL933038)
Ki 1.4±n/a nM
Citation Deaton, DNGao, ENGraham, KPGross, JWMiller, ABStrelow, JM Thiol-based angiotensin-converting enzyme 2 inhibitors: P1 modifications for the exploration of the S1 subsite. Bioorg Med Chem Lett18:732-7 (2008) 
 
Angiotensin-converting enzyme 2
Name:Angiotensin-converting enzyme 2
Type:Enzyme
Mol. Mass.:92448.86
Organism:Homo sapiens (Human)
Description:n/a
Residue:805
BDBM50411731
NameBDBM50411731
Synonyms:CHEMBL257726
TypeSmall organic molecule
Emp. Form.C19H21NO3S
Mol. Mass.343.44
SMILESCC[C@H](S)C(=O)N[C@@H](Cc1ccc(cc1)-c1ccccc1)C(O)=O