Reaction Details
Target11-beta-hydroxysteroid dehydrogenase 1
LigandBDBM50174298
Substrate/Competitorn/a
Meas. Tech.ChEMBL_474247 (CHEMBL934096)
IC50 2±n/a nM
Citation Lee, JHKang, NSYoo, SE Docking-based 3D-QSAR study for 11beta-HSD1 inhibitors. Bioorg Med Chem Lett18:2479-90 (2008) 
 
11-beta-hydroxysteroid dehydrogenase 1
Name:11-beta-hydroxysteroid dehydrogenase 1
Type:Enzyme
Mol. Mass.:32409.16
Organism:Homo sapiens (Human)
Description:P28845
Residue:292
BDBM50174298
NameBDBM50174298
Synonyms:3-(4-(3-(4-fluorophenyl)-1,2,4-oxadiazol-5-yl)bicyclo[2.2.2]octan-1-yl)-4-methyl-5-(2-(trifluoromethyl)phenyl)-4H-1,2,4-triazole | CHEMBL373257
TypeSmall organic molecule
Emp. Form.C26H23F4N5O
Mol. Mass.497.4873
SMILESCn1c(nnc1C12CCC(CC1)(CC2)c1nc(no1)-c1ccc(F)cc1)-c1ccccc1C(F)(F)F