Reaction Details
Target7-dehydrocholesterol reductase
LigandBDBM50412080
Substrate/Competitorn/a
Meas. Tech.ChEMBL_550766 (CHEMBL1008660)
IC50 400±n/a nM
Citation Chang, LCBhat, KPPisha, EKennelly, EJFong, HHPezzuto, JMKinghorn, AD Activity-guided isolation of steroidal alkaloid antiestrogen-binding site inhibitors from Pachysandra procumbens. J Nat Prod61:1257-62 (1998) 
 
7-dehydrocholesterol reductase
Name:7-dehydrocholesterol reductase
Type:PROTEIN
Mol. Mass.:54508.42
Organism:Homo sapiens (Human)
Description:ChEMBL_864350
Residue:475
BDBM50412080
NameBDBM50412080
Synonyms:CHEMBL342394
TypeSmall organic molecule
Emp. Form.C24H41NO
Mol. Mass.359.5884
SMILESCO[C@H]1CC[C@]2(C)[C@H]3CC[C@]4(C)[C@H](CC[C@H]4[C@@H]3CC=C2C1)[C@H](C)N(C)C