Reaction Details
Target7-dehydrocholesterol reductase
LigandBDBM50412082
Substrate/Competitorn/a
Meas. Tech.ChEMBL_550766 (CHEMBL1008660)
IC50 600±n/a nM
Citation Chang, LCBhat, KPPisha, EKennelly, EJFong, HHPezzuto, JMKinghorn, AD Activity-guided isolation of steroidal alkaloid antiestrogen-binding site inhibitors from Pachysandra procumbens. J Nat Prod61:1257-62 (1998) 
 
7-dehydrocholesterol reductase
Name:7-dehydrocholesterol reductase
Type:PROTEIN
Mol. Mass.:54508.42
Organism:Homo sapiens (Human)
Description:ChEMBL_864350
Residue:475
BDBM50412082
NameBDBM50412082
Synonyms:CHEMBL455316
TypeSmall organic molecule
Emp. Form.C32H46N2O3
Mol. Mass.506.7192
SMILESC[C@@H]([C@H]1CC[C@H]2[C@@H]3CC[C@H]4[C@@H](OC(C)=O)C(NC(=O)c5ccccc5)=CC[C@]4(C)[C@H]3CC[C@]12C)N(C)C