Reaction Details
TargetMuscarinic acetylcholine receptor M2
LigandBDBM50412183
Substrate/Competitorn/a
Meas. Tech.ChEMBL_556678 (CHEMBL958965)
Ki 95.5±n/a nM
Citation Dei, SBellucci, CBuccioni, MFerraroni, MGuandalini, LManetti, DMarucci, GMatucci, RNesi, MRomanelli, MNScapecchi, STeodori, E Muscarinic antagonists with multiple stereocenters: Synthesis, affinity profile and functional activity of isomeric 1-methyl-2-(2,2-alkylaryl-1,3-oxathiolan-5-yl)pyrrolidine sulfoxide derivatives. Bioorg Med Chem16:5490-500 (2008) 
 
Muscarinic acetylcholine receptor M2
Name:Muscarinic acetylcholine receptor M2
Type:GPCR
Mol. Mass.:51730.61
Organism:Homo sapiens (Human)
Description:P08172
Residue:466
BDBM50412183
NameBDBM50412183
Synonyms:CHEMBL554916
TypeSmall organic molecule
Emp. Form.C21H32NO2S
Mol. Mass.362.549
SMILESC[N+]1(C)CCC[C@@H]1[C@@H]1CS(=O)[C@@](O1)(C1CCCCC1)c1ccccc1