Reaction Details
TargetMuscarinic acetylcholine receptor M3
LigandBDBM50412177
Substrate/Competitorn/a
Meas. Tech.ChEMBL_556679 (CHEMBL958966)
Ki 42.66±n/a nM
Citation Dei, SBellucci, CBuccioni, MFerraroni, MGuandalini, LManetti, DMarucci, GMatucci, RNesi, MRomanelli, MNScapecchi, STeodori, E Muscarinic antagonists with multiple stereocenters: Synthesis, affinity profile and functional activity of isomeric 1-methyl-2-(2,2-alkylaryl-1,3-oxathiolan-5-yl)pyrrolidine sulfoxide derivatives. Bioorg Med Chem16:5490-500 (2008) 
 
Muscarinic acetylcholine receptor M3
Name:Muscarinic acetylcholine receptor M3
Type:Enzyme
Mol. Mass.:66151.03
Organism:Homo sapiens (Human)
Description:P20309
Residue:590
BDBM50412177
NameBDBM50412177
Synonyms:CHEMBL493979
TypeSmall organic molecule
Emp. Form.C20H29NO2S
Mol. Mass.347.515
SMILESCN1CCC[C@@H]1[C@@H]1CS(=O)[C@@](O1)(C1CCCCC1)c1ccccc1