Reaction Details
TargetHistidine-rich protein PFHRP-II
LigandBDBM50412203
Substrate/Competitorn/a
Meas. Tech.ChEMBL_549674 (CHEMBL997303)
IC50 7590000000±n/a nM
Citation Van Miert, SHostyn, SMaes, BUCimanga, KBrun, RKaiser, MMátyus, PDommisse, RLemière, GVlietinck, APieters, L Isoneocryptolepine, a synthetic indoloquinoline alkaloid, as an antiplasmodial lead compound. J Nat Prod68:674-7 (2005) 
 
Histidine-rich protein PFHRP-II
Name:Histidine-rich protein PFHRP-II
Type:PROTEIN
Mol. Mass.:35156.49
Organism:Plasmodium falciparum
Description:ChEMBL_500704
Residue:332
BDBM50412203
NameBDBM50412203
Synonyms:CHEMBL502768
TypeSmall organic molecule
Emp. Form.C16H12N2
Mol. Mass.232.2799
SMILESCn1cc2c3ccccc3nc2c2ccccc12