Reaction Details
TargetHistidine-rich protein PFHRP-II
LigandBDBM50367247
Substrate/Competitorn/a
Meas. Tech.ChEMBL_549674 (CHEMBL997303)
IC50 7400000000±n/a nM
Citation Van Miert, SHostyn, SMaes, BUCimanga, KBrun, RKaiser, MMátyus, PDommisse, RLemière, GVlietinck, APieters, L Isoneocryptolepine, a synthetic indoloquinoline alkaloid, as an antiplasmodial lead compound. J Nat Prod68:674-7 (2005) 
 
Histidine-rich protein PFHRP-II
Name:Histidine-rich protein PFHRP-II
Type:PROTEIN
Mol. Mass.:35156.49
Organism:Plasmodium falciparum
Description:ChEMBL_500704
Residue:332
BDBM50367247
NameBDBM50367247
Synonyms:QUININE Quinsan | cid_3034034
TypeSmall organic molecule
Emp. Form.C20H24N2O2
Mol. Mass.324.4168
SMILESCOc1ccc2nccc([C@@H](O)[C@@H]3C[C@@H]4CCN3C[C@@H]4C=C)c2c1