Reaction Details
TargetMuscarinic acetylcholine receptor M2
LigandBDBM82423
Substrate/Competitorn/a
Meas. Tech.ChEMBL_491019 (CHEMBL982067)
Ki 0.302±n/a nM
Citation Minarini, AMarucci, GBellucci, CGiorgi, GTumiatti, VBolognesi, MLMatera, RRosini, MMelchiorre, C Design, synthesis, and biological evaluation of pirenzepine analogs bearing a 1,2-cyclohexanediamine and perhydroquinoxaline units in exchange for the piperazine ring as antimuscarinics. Bioorg Med Chem16:7311-20 (2008) 
 
Muscarinic acetylcholine receptor M2
Name:Muscarinic acetylcholine receptor M2
Type:GPCR
Mol. Mass.:51730.61
Organism:Homo sapiens (Human)
Description:P08172
Residue:466
BDBM82423
NameBDBM82423
Synonyms:CAS_132947 TRIPITRAMINE
TypeSmall organic molecule
Emp. Form.C64H77N13O6
Mol. Mass.1124.3797
SMILESCN(CCCCCCCCN(C)CCCCCCN(CC(=O)N1c2ccccc2C(=O)Nc2cccnc12)CC(=O)N1c2ccccc2C(=O)Nc2cccnc12)CCCCCCNCC(=O)N1c2ccccc2C(=O)Nc2cccnc12