Reaction Details
TargetNeuronal acetylcholine receptor subunit alpha-3
LigandBDBM50201059
Substrate/Competitorn/a
Meas. Tech.ChEMBL_558728 (CHEMBL954130)
EC50 75.86±n/a nM
Citation Ye, MDawson, MI 3D-QSAR and QSSR studies of 3,8-diazabicyclo[4.2.0]octane derivatives as neuronal nicotinic acetylcholine receptors by comparative molecular field analysis (CoMFA). Bioorg Med Chem Lett19:127-31 (2008) 
 
Neuronal acetylcholine receptor subunit alpha-3
Name:Neuronal acetylcholine receptor subunit alpha-3
Type:Enzyme Catalytic Domain
Mol. Mass.:57479.03
Organism:Homo sapiens (Human)
Description:Cholinergic, Nicotinic Alpha3Beta2 0 HUMAN::P32297
Residue:505
BDBM50201059
NameBDBM50201059
Synonyms:(1R,6S)-3-(5-bromo-pyridin-3-yl)-3,8-diaza-bicyclo[4.2.0]octane CHEMBL375790
TypeSmall organic molecule
Emp. Form.C11H14BrN3
Mol. Mass.268.153
SMILESBrc1cncc(c1)N1CC[C@H]2CN[C@H]2C1