Reaction Details
TargetNeuronal acetylcholine receptor subunit alpha-3
LigandBDBM50411225
Substrate/Competitorn/a
Meas. Tech.ChEMBL_558728 (CHEMBL954130)
EC50 158.49±n/a nM
Citation Ye, MDawson, MI 3D-QSAR and QSSR studies of 3,8-diazabicyclo[4.2.0]octane derivatives as neuronal nicotinic acetylcholine receptors by comparative molecular field analysis (CoMFA). Bioorg Med Chem Lett19:127-31 (2008) 
 
Neuronal acetylcholine receptor subunit alpha-3
Name:Neuronal acetylcholine receptor subunit alpha-3
Type:Enzyme Catalytic Domain
Mol. Mass.:57479.03
Organism:Homo sapiens (Human)
Description:Cholinergic, Nicotinic Alpha3Beta2 0 HUMAN::P32297
Residue:505
BDBM50411225
NameBDBM50411225
Synonyms:CHEMBL451632
TypeSmall organic molecule
Emp. Form.C12H16BrN3O
Mol. Mass.298.179
SMILESCOc1cc(cnc1Br)N1CC[C@@H]2CN[C@@H]2C1