Reaction Details
TargetNeuronal acetylcholine receptor subunit alpha-3
LigandBDBM50201060
Substrate/Competitorn/a
Meas. Tech.ChEMBL_558728 (CHEMBL954130)
EC50 1380.38±n/a nM
Citation Ye, MDawson, MI 3D-QSAR and QSSR studies of 3,8-diazabicyclo[4.2.0]octane derivatives as neuronal nicotinic acetylcholine receptors by comparative molecular field analysis (CoMFA). Bioorg Med Chem Lett19:127-31 (2008) 
 
Neuronal acetylcholine receptor subunit alpha-3
Name:Neuronal acetylcholine receptor subunit alpha-3
Type:Enzyme Catalytic Domain
Mol. Mass.:57479.03
Organism:Homo sapiens (Human)
Description:Cholinergic, Nicotinic Alpha3Beta2 0 HUMAN::P32297
Residue:505
BDBM50201060
NameBDBM50201060
Synonyms:(1R,6S)-8-(6-chloro-pyridin-3-yl)-3,8-diaza-bicyclo[4.2.0]octane | CHEMBL220411
TypeSmall organic molecule
Emp. Form.C11H14ClN3
Mol. Mass.223.702
SMILESClc1ccc(cn1)N1C[C@@H]2CCNC[C@H]12