Reaction Details
TargetNeuronal acetylcholine receptor subunit alpha-3
LigandBDBM50201053
Substrate/Competitorn/a
Meas. Tech.ChEMBL_558728 (CHEMBL954130)
EC50 794.33±n/a nM
Citation Ye, MDawson, MI 3D-QSAR and QSSR studies of 3,8-diazabicyclo[4.2.0]octane derivatives as neuronal nicotinic acetylcholine receptors by comparative molecular field analysis (CoMFA). Bioorg Med Chem Lett19:127-31 (2008) 
 
Neuronal acetylcholine receptor subunit alpha-3
Name:Neuronal acetylcholine receptor subunit alpha-3
Type:Enzyme Catalytic Domain
Mol. Mass.:57479.03
Organism:Homo sapiens (Human)
Description:Cholinergic, Nicotinic Alpha3Beta2 0 HUMAN::P32297
Residue:505
BDBM50201053
NameBDBM50201053
Synonyms:(1R,6S)-2-bromo-5-(3,8-diaza-bicyclo[4.2.0]oct-8-yl)-nicotinonitrile CHEMBL220295
TypeSmall organic molecule
Emp. Form.C12H13BrN4
Mol. Mass.293.162
SMILESBrc1ncc(cc1C#N)N1C[C@@H]2CCNC[C@H]12