Reaction Details
TargetNeuromedin-K receptor
LigandBDBM50412943
Substrate/Competitorn/a
Meas. Tech.ChEMBL_515484 (CHEMBL992211)
Ki 2±n/a nM
Citation Smith, PWWyman, PALovell, PGoodacre, CSerafinowska, HTVong, AHarrington, FFlynn, SBradley, DMPorter, RCoggon, SMurkitt, GSearle, KThomas, DRWatson, JMMartin, WWu, ZDawson, LA New quinoline NK3 receptor antagonists with CNS activity. Bioorg Med Chem Lett19:837-40 (2009) 
 
Neuromedin-K receptor
Name:Neuromedin-K receptor
Type:Enzyme
Mol. Mass.:52221.96
Organism:Homo sapiens (Human)
Description:P29371
Residue:465
BDBM50412943
NameBDBM50412943
Synonyms:CHEMBL480818
TypeSmall organic molecule
Emp. Form.C25H23N3O
Mol. Mass.381.4696
SMILESCC[C@H](NC(=O)c1c(N)c(nc2ccccc12)-c1ccccc1)c1ccccc1