Reaction Details
TargetNeuromedin-K receptor
LigandBDBM50412944
Substrate/Competitorn/a
Meas. Tech.ChEMBL_515484 (CHEMBL992211)
Ki 3.16±n/a nM
Citation Smith, PWWyman, PALovell, PGoodacre, CSerafinowska, HTVong, AHarrington, FFlynn, SBradley, DMPorter, RCoggon, SMurkitt, GSearle, KThomas, DRWatson, JMMartin, WWu, ZDawson, LA New quinoline NK3 receptor antagonists with CNS activity. Bioorg Med Chem Lett19:837-40 (2009) 
 
Neuromedin-K receptor
Name:Neuromedin-K receptor
Type:Enzyme
Mol. Mass.:52221.96
Organism:Homo sapiens (Human)
Description:P29371
Residue:465
BDBM50412944
NameBDBM50412944
Synonyms:CHEMBL479652
TypeSmall organic molecule
Emp. Form.C26H22FN3O
Mol. Mass.411.4708
SMILESNc1c(nc2ccccc2c1C(=O)N[C@@H](C1CC1)c1cccc(F)c1)-c1ccccc1