Reaction Details
TargetNeuromedin-K receptor
LigandBDBM50412947
Substrate/Competitorn/a
Meas. Tech.ChEMBL_515484 (CHEMBL992211)
Ki 5.01±n/a nM
Citation Smith, PWWyman, PALovell, PGoodacre, CSerafinowska, HTVong, AHarrington, FFlynn, SBradley, DMPorter, RCoggon, SMurkitt, GSearle, KThomas, DRWatson, JMMartin, WWu, ZDawson, LA New quinoline NK3 receptor antagonists with CNS activity. Bioorg Med Chem Lett19:837-40 (2009) 
 
Neuromedin-K receptor
Name:Neuromedin-K receptor
Type:Enzyme
Mol. Mass.:52221.96
Organism:Homo sapiens (Human)
Description:P29371
Residue:465
BDBM50412947
NameBDBM50412947
Synonyms:5-(3-METHYL-1-TRIAZENO)IMIDAZOLE-4-CARBOXAMIDE
TypeSmall organic molecule
Emp. Form.C26H23N3O
Mol. Mass.393.4803
SMILESNc1c(nc2ccccc2c1C(=O)N[C@@H](C1CC1)c1ccccc1)-c1ccccc1