Reaction Details
TargetNeuromedin-K receptor
LigandBDBM50412950
Substrate/Competitorn/a
Meas. Tech.ChEMBL_515484 (CHEMBL992211)
Ki 7.94±n/a nM
Citation Smith, PWWyman, PALovell, PGoodacre, CSerafinowska, HTVong, AHarrington, FFlynn, SBradley, DMPorter, RCoggon, SMurkitt, GSearle, KThomas, DRWatson, JMMartin, WWu, ZDawson, LA New quinoline NK3 receptor antagonists with CNS activity. Bioorg Med Chem Lett19:837-40 (2009) 
 
Neuromedin-K receptor
Name:Neuromedin-K receptor
Type:Enzyme
Mol. Mass.:52221.96
Organism:Homo sapiens (Human)
Description:P29371
Residue:465
BDBM50412950
NameBDBM50412950
Synonyms:CHEMBL479450
TypeSmall organic molecule
Emp. Form.C25H22FN3O
Mol. Mass.399.4601
SMILESCC[C@H](NC(=O)c1c(N)c(nc2ccccc12)-c1ccc(F)cc1)c1ccccc1