Reaction Details
TargetUrotensin-2 receptor
LigandBDBM50413042
Substrate/Competitorn/a
Meas. Tech.ChEMBL_496754 (CHEMBL1005391)
Ki 12.59±n/a nM
Citation Wang, YWu, ZGuida, BFLawrence, SKNeeb, MJRivero, RADouglas, SAJin, J N-alkyl-5H-pyrido[4,3-b]indol-1-amines and derivatives as novel urotensin-II receptor antagonists. Bioorg Med Chem Lett18:4936-9 (2008) 
 
Urotensin-2 receptor
Name:Urotensin-2 receptor
Type:Enzyme Catalytic Domain
Mol. Mass.:42159.71
Organism:Homo sapiens (Human)
Description:Urotensin-II UTS2R HUMAN::Q9UKP6
Residue:389
BDBM50413042
NameBDBM50413042
Synonyms:CHEMBL495907
TypeSmall organic molecule
Emp. Form.C15H17N3O
Mol. Mass.255.315
SMILESCCOCCNc1nccc2[nH]c3ccccc3c12