Reaction Details
Target5-hydroxytryptamine receptor 1D
LigandBDBM50413071
Substrate/Competitorn/a
Meas. Tech.ChEMBL_492740 (CHEMBL938540)
Ki 0.501±n/a nM
Citation Bromidge, SMBertani, BBorriello, MFaedo, SGordon, LJGranci, EHill, MMarshall, HRStasi, LPZucchelli, VMerlo, GVesentini, AWatson, JMZonzini, L 6-[2-(4-Aryl-1-piperazinyl)ethyl]-2H-1,4-benzoxazin-3(4H)-ones: dual-acting 5-HT1 receptor antagonists and serotonin reuptake inhibitors. Bioorg Med Chem Lett18:5653-6 (2008) 
 
5-hydroxytryptamine receptor 1D
Name:5-hydroxytryptamine receptor 1D
Type:G Protein-Coupled Receptor (GPCR)
Mol. Mass.:41920.63
Organism:Homo sapiens (Human)
Description:Receptor binding assays were performed using human clone stably expressed in CHO cells.
Residue:377
BDBM50413071
NameBDBM50413071
Synonyms:CHEMBL521873
TypeSmall organic molecule
Emp. Form.C25H28N4O2
Mol. Mass.416.5154
SMILESC[C@@H]1CN(CCN1CCc1ccc2OCC(=O)Nc2c1)c1cccc2nc(C)ccc12