Reaction Details
TargetSodium-dependent serotonin transporter
LigandBDBM50413076
Substrate/Competitorn/a
Meas. Tech.ChEMBL_492741 (CHEMBL938541)
Ki 79.43±n/a nM
Citation Bromidge, SMBertani, BBorriello, MFaedo, SGordon, LJGranci, EHill, MMarshall, HRStasi, LPZucchelli, VMerlo, GVesentini, AWatson, JMZonzini, L 6-[2-(4-Aryl-1-piperazinyl)ethyl]-2H-1,4-benzoxazin-3(4H)-ones: dual-acting 5-HT1 receptor antagonists and serotonin reuptake inhibitors. Bioorg Med Chem Lett18:5653-6 (2008) 
 
Sodium-dependent serotonin transporter
Name:Sodium-dependent serotonin transporter
Type:Multi-pass membrane protein
Mol. Mass.:70322.51
Organism:Homo sapiens (Human)
Description:P31645
Residue:630
BDBM50413076
NameBDBM50413076
Synonyms:CHEMBL489393
TypeSmall organic molecule
Emp. Form.C26H30N4O2
Mol. Mass.430.542
SMILESCCN1C(=O)COc2ccc(CCN3CCN(CC3)c3cccc4nc(C)ccc34)cc12