Reaction Details
Target5-hydroxytryptamine receptor 1D
LigandBDBM50413079
Substrate/Competitorn/a
Meas. Tech.ChEMBL_492740 (CHEMBL938540)
Ki 0.2±n/a nM
Citation Bromidge, SMBertani, BBorriello, MFaedo, SGordon, LJGranci, EHill, MMarshall, HRStasi, LPZucchelli, VMerlo, GVesentini, AWatson, JMZonzini, L 6-[2-(4-Aryl-1-piperazinyl)ethyl]-2H-1,4-benzoxazin-3(4H)-ones: dual-acting 5-HT1 receptor antagonists and serotonin reuptake inhibitors. Bioorg Med Chem Lett18:5653-6 (2008) 
 
5-hydroxytryptamine receptor 1D
Name:5-hydroxytryptamine receptor 1D
Type:G Protein-Coupled Receptor (GPCR)
Mol. Mass.:41920.63
Organism:Homo sapiens (Human)
Description:Receptor binding assays were performed using human clone stably expressed in CHO cells.
Residue:377
BDBM50413079
NameBDBM50413079
Synonyms:CHEMBL444398
TypeSmall organic molecule
Emp. Form.C23H26N4O2
Mol. Mass.390.4781
SMILESCc1cc2c(cccc2[nH]1)N1CCN(CCc2ccc3OCC(=O)Nc3c2)CC1