Reaction Details
Target5-hydroxytryptamine receptor 1D
LigandBDBM50413087
Substrate/Competitorn/a
Meas. Tech.ChEMBL_492740 (CHEMBL938540)
Ki 0.2±n/a nM
Citation Bromidge, SMBertani, BBorriello, MFaedo, SGordon, LJGranci, EHill, MMarshall, HRStasi, LPZucchelli, VMerlo, GVesentini, AWatson, JMZonzini, L 6-[2-(4-Aryl-1-piperazinyl)ethyl]-2H-1,4-benzoxazin-3(4H)-ones: dual-acting 5-HT1 receptor antagonists and serotonin reuptake inhibitors. Bioorg Med Chem Lett18:5653-6 (2008) 
 
5-hydroxytryptamine receptor 1D
Name:5-hydroxytryptamine receptor 1D
Type:G Protein-Coupled Receptor (GPCR)
Mol. Mass.:41920.63
Organism:Homo sapiens (Human)
Description:Receptor binding assays were performed using human clone stably expressed in CHO cells.
Residue:377
BDBM50413087
NameBDBM50413087
Synonyms:CHEMBL497980
TypeSmall organic molecule
Emp. Form.C24H25ClN4O2
Mol. Mass.436.934
SMILESCc1ccc2c(ccc(Cl)c2n1)N1CCN(CCc2ccc3OCC(=O)Nc3c2)CC1