Reaction Details
TargetBeta-3 adrenergic receptor
LigandBDBM50413487
Substrate/Competitorn/a
Meas. Tech.ChEMBL_562923 (CHEMBL1019683)
EC50 794±n/a nM
Citation Procopiou, PABarrett, VJBevan, NJBiggadike, KButchers, PRCoe, DMConroy, REdney, DDField, RNFord, AJGuntrip, SBLooker, BEMcLay, IMMonteith, MJMorrison, VSMutch, PJRichards, SASasse, RSmith, CE Synthesis and structure-activity relationships of long-acting beta2 adrenergic receptor agonists incorporating arylsulfonamide groups. J Med Chem52:2280-8 (2009) 
 
Beta-3 adrenergic receptor
Name:Beta-3 adrenergic receptor
Type:G Protein-Coupled Receptor (GPCR)
Mol. Mass.:43534.88
Organism:Homo sapiens (Human)
Description:n/a
Residue:408
BDBM50413487
NameBDBM50413487
Synonyms:CHEMBL516056
TypeSmall organic molecule
Emp. Form.C26H40N2O6S
Mol. Mass.508.671
SMILESCNS(=O)(=O)c1cccc(CCCCOCCCCCCNC[C@H](O)c2ccc(O)c(CO)c2)c1