Reaction Details
TargetBeta-3 adrenergic receptor
LigandBDBM50413490
Substrate/Competitorn/a
Meas. Tech.ChEMBL_562923 (CHEMBL1019683)
EC50 158±n/a nM
Citation Procopiou, PABarrett, VJBevan, NJBiggadike, KButchers, PRCoe, DMConroy, REdney, DDField, RNFord, AJGuntrip, SBLooker, BEMcLay, IMMonteith, MJMorrison, VSMutch, PJRichards, SASasse, RSmith, CE Synthesis and structure-activity relationships of long-acting beta2 adrenergic receptor agonists incorporating arylsulfonamide groups. J Med Chem52:2280-8 (2009) 
 
Beta-3 adrenergic receptor
Name:Beta-3 adrenergic receptor
Type:G Protein-Coupled Receptor (GPCR)
Mol. Mass.:43534.88
Organism:Homo sapiens (Human)
Description:n/a
Residue:408
BDBM50413490
NameBDBM50413490
Synonyms:CHEMBL506518
TypeSmall organic molecule
Emp. Form.C30H46N2O6S
Mol. Mass.562.761
SMILESOCc1cc(ccc1O)[C@@H](O)CNCCCCCCOCCCCc1cccc(c1)S(=O)(=O)N1CCCCC1