Reaction Details
TargetBeta-3 adrenergic receptor
LigandBDBM50413482
Substrate/Competitorn/a
Meas. Tech.ChEMBL_562923 (CHEMBL1019683)
EC50 200±n/a nM
Citation Procopiou, PABarrett, VJBevan, NJBiggadike, KButchers, PRCoe, DMConroy, REdney, DDField, RNFord, AJGuntrip, SBLooker, BEMcLay, IMMonteith, MJMorrison, VSMutch, PJRichards, SASasse, RSmith, CE Synthesis and structure-activity relationships of long-acting beta2 adrenergic receptor agonists incorporating arylsulfonamide groups. J Med Chem52:2280-8 (2009) 
 
Beta-3 adrenergic receptor
Name:Beta-3 adrenergic receptor
Type:G Protein-Coupled Receptor (GPCR)
Mol. Mass.:43534.88
Organism:Homo sapiens (Human)
Description:n/a
Residue:408
BDBM50413482
NameBDBM50413482
Synonyms:CHEMBL443435
TypeSmall organic molecule
Emp. Form.C25H37N3O6S
Mol. Mass.507.643
SMILESNS(=O)(=O)c1cccc(CCCCOCCCCCCNC[C@H](O)c2ccc(O)c(NC=O)c2)c1