Reaction Details
Target5-hydroxytryptamine receptor 1D
LigandBDBM50413556
Substrate/Competitorn/a
Meas. Tech.ChEMBL_501243 (CHEMBL976145)
Ki 0.316±n/a nM
Citation Bromidge, SMBertani, BBorriello, MBozzoli, AFaedo, SGianotti, MGordon, LJHill, MZucchelli, VWatson, JMZonzini, L 8-[2-(4-Aryl-1-piperazinyl)ethyl]-2H-1,4-benzoxazin-3(4H)-ones: dual-acting 5-HT1 receptor antagonists and serotonin reuptake inhibitors--part II. Bioorg Med Chem Lett19:2338-42 (2009) 
 
5-hydroxytryptamine receptor 1D
Name:5-hydroxytryptamine receptor 1D
Type:G Protein-Coupled Receptor (GPCR)
Mol. Mass.:41920.63
Organism:Homo sapiens (Human)
Description:Receptor binding assays were performed using human clone stably expressed in CHO cells.
Residue:377
BDBM50413556
NameBDBM50413556
Synonyms:CHEMBL469995
TypeSmall organic molecule
Emp. Form.C28H32N4O2
Mol. Mass.456.5793
SMILESCc1ccc2c(cccc2n1)N1CCN(CCc2cccc3N(CC4CC4)C(=O)COc23)CC1