Reaction Details
TargetSodium-dependent serotonin transporter
LigandBDBM50413561
Substrate/Competitorn/a
Meas. Tech.ChEMBL_501245 (CHEMBL976147)
Ki 2±n/a nM
Citation Bromidge, SMBertani, BBorriello, MBozzoli, AFaedo, SGianotti, MGordon, LJHill, MZucchelli, VWatson, JMZonzini, L 8-[2-(4-Aryl-1-piperazinyl)ethyl]-2H-1,4-benzoxazin-3(4H)-ones: dual-acting 5-HT1 receptor antagonists and serotonin reuptake inhibitors--part II. Bioorg Med Chem Lett19:2338-42 (2009) 
 
Sodium-dependent serotonin transporter
Name:Sodium-dependent serotonin transporter
Type:Multi-pass membrane protein
Mol. Mass.:70322.51
Organism:Homo sapiens (Human)
Description:P31645
Residue:630
BDBM50413561
NameBDBM50413561
Synonyms:CHEMBL513875
TypeSmall organic molecule
Emp. Form.C26H29FN4O2
Mol. Mass.448.5325
SMILESC[C@@H]1CN(CCN1CCc1cccc2N(C)C(=O)COc12)c1cc(F)cc2nc(C)ccc12